{"text_format":"3","workbook":"xlsx","n_sheets":4,"sheets":["Instrucciones","Valoración de jueces","Cálculo de susceptibilidad","Ejemplo"],"not_rendered":{"images":2,"macros":1,"defined_names":1},"read":"whole","date_system":"1900"}

{"sheet":"Instrucciones","index":0,"n_rows":0,"n_cols":0,"rows_kept":0}

{"sheet":"Valoración de jueces","index":1,"n_rows":9,"n_cols":12,"rows_kept":9,"hidden":true}
[]
["Identificador","Atributos ","Valoración 1","Valoración 2","Valoración 3","Valoración 4","Valoración 5","Total  ","Media ",null,"Observadores",5]
["A","Accesibilidad a SNS ",{"$nulls":5},{"$f":"SUM(C3:G3)","v":0},{"$f":"H3/$L$2","v":0}]
["B","Privación de instalaciones ",{"$nulls":5},{"$f":"SUM(C4:G4)","v":0},{"$f":"H4/$L$2","v":0}]
["C","Barreras físicas ",{"$nulls":5},{"$f":"SUM(C5:G5)","v":0},0]
["D","Exposición, estado de salud ",{"$nulls":5},0,0]
["E","Aceptabilidad ",{"$nulls":5},0,0]
["F","Resiliencia ",{"$nulls":5},0,0]
["G","Afección a recurso compartido ",{"$nulls":5},0,0]

{"sheet":"Cálculo de susceptibilidad","index":2,"n_rows":34,"n_cols":25,"rows_kept":34,"hidden":true,"merged":[[10,12,11,12],[10,13,11,13],[10,14,10,20],[23,12,24,12],[23,13,24,13],[23,14,23,20],[23,21,24,21],[23,22,24,22],[23,23,24,23]]}
[]
["Paso 1",null,"Signo"]
[{"$nulls":3},"-","se prevée que el impacto tenga un efecto negativo sobre la población"]
[{"$nulls":3},"+","se prevee que el impacto tenga un efecto positivo sobre la población"]
[null,"A)","Accesibilidad al SNS"]
[{"$nulls":3},1,"Su efecto sobre la accesibilidad al SNS es limitado"]
[{"$nulls":3},2,"Su efectos sobre el SNS puede modificar determinantes en salud",{"$nulls":6},"Pasos 2 y 3","Valor mínimo de susceptibilidad",null,null,{"$f":"D6*E5+D11*E10+D15*E14+D19*E18+D23*E22+D27*E26+D30*E29","v":0}]
[{"$nulls":3},3,"Su efecto en el SNS impacta directamente sobre la salud",{"$nulls":7},"Valor máximo de susceptibilidad",null,null,{"$f":"D9*E5+D13*E10+D17*E14+D21*E18+D25*E22+D31*E29","v":0}]
[{"$nulls":3},4,"Su efecto sobre el SNS afecta al suministro de sanidad a la población afectada",{"$nulls":7},"Rango",null,null,{"$f":"P8-P7","v":0}]
[null,"B)","Privación de instalaciones"]
[{"$nulls":3},1,"Tiene un efecto modesto sobre el acceso a las instalaciones",{"$nulls":6},"Paso 4","Impacto ","Signo ","Atributos"]
[{"$nulls":3},2,"Tiene un efecto medio sobre el acceso a las instalaciones",{"$nulls":9},"A","B","C","D","E","F","G",null,"Valor estandarizado","Determinación de susceptibilidad para impactos de signo negativo","Determinación de susceptibilidad para impactos de signo positivo"]
[{"$nulls":3},3,"Tiene un gran efecto sobre el acceso a las instalaciones",{"$nulls":7},"1 ","+",{"$nulls":8},"0 - 0,25","Compatible","Compatible"]
[null,"C)","Barreras físicas ",{"$nulls":9},"2 ","+",{"$nulls":8},"0,26 - 0,5","Moderado","Moderado"]
[{"$nulls":3},1,"Aumenta el esfuerzo necesario para acceder a una instalación ",{"$nulls":7},"3 ","+",{"$nulls":8},"0,6 - 0,75","Severo","Oportuno"]
[{"$nulls":3},2,"Dificulta significativamente el acceso a una instalación ",{"$nulls":7},"4 ","+",{"$nulls":8},"0,76 - 1","Crítico","Esencial"]
[{"$nulls":3},3,"Imposibilita el acceso a una instalación ",{"$nulls":7},"5 ","+"]
[null,"D)","Exposición, estado de salud ",{"$nulls":9},"6 ","+"]
[{"$nulls":3},1,"Supone un cambio leve en la exposición o agente determinante para la salud ",{"$nulls":7},"7 ","+"]
[{"$nulls":3},2,"Supone un cambio medio en la exposición o agente determinante para la salud ",{"$nulls":7},"8 ","-"]
[{"$nulls":3},3,"Supone un cambio alto en la exposición o agente determinante para la salud ",{"$nulls":7},"9 ","+"]
[null,"E)","Aceptabilidad "]
[{"$nulls":3},1,"Grado de aceptación alto "]
[{"$nulls":3},2,"Grado de aceptación medio ",{"$nulls":6},"Pasos 5 y 6","Impacto ","Signo ","Atributos",{"$nulls":6},"Total ","Estándar ","Susceptiblidadad "]
[{"$nulls":3},3,"Grado de aceptación bajo ",{"$nulls":9},"A","B","C","D","E","F","G"]
[null,"F)","Resiliencia ",{"$nulls":9},"1 ","+",{"$f":"O13*$E$5","v":0},{"$f":"P13*$E$10","v":0},{"$f":"Q13*$E$14","v":0},{"$f":"R13*$E$18","v":0},{"$f":"S13*$E$22","v":0},{"$f":"T13*$E$26","v":0},{"$f":"U13*$E$29","v":0},{"$f":"SUM(O26:U26)","v":0},{"$f":"(V26-$P$8)/$P$9","v":{"$error":"#DIV/0!"}},{"$f":"_xlfn.IFS(\n  AND(N26=\"+\", W26>=0.75), $Y$16,\n  AND(N26=\"+\", W26>=0.5), $Y$15,\n  AND(N26=\"+\", W26>=0.25), $Y$14,\n  AND(N26=\"+\", W26<0.25), $Y$13,\n  AND(N26=\"-\", W26>=0.75), $X$16,\n  AND(N26=\"-\", W26>=0.5), $X$15,\n  AND(N26=\"-\", W26>=0.25), $X$14,\n  AND(N26=\"-\", W26<0.25), $X$13\n)","v":{"$error":"#DIV/0!"}}]
[{"$nulls":3},1,"El impacto puede ser absorbido por la población expuesta ",{"$nulls":7},"2 ","+",{"$f":"O14*$E$5","v":0},{"$f":"P14*$E$10","v":0},{"$f":"Q14*$E$14","v":0},{"$f":"R14*$E$18","v":0},{"$f":"S14*$E$22","v":0},{"$f":"T14*$E$26","v":0},{"$f":"U14*$E$29","v":0},{"$f":"SUM(O27:U27)","v":0},{"$f":"(V27-$P$8)/$P$9","v":{"$error":"#DIV/0!"}},{"$f":"_xlfn.IFS(\n  AND(N27=\"+\", W27>=0.75), $Y$16,\n  AND(N27=\"+\", W27>=0.5), $Y$15,\n  AND(N27=\"+\", W27>=0.25), $Y$14,\n  AND(N27=\"+\", W27<0.25), $Y$13,\n  AND(N27=\"-\", W27>=0.75), $X$16,\n  AND(N27=\"-\", W27>=0.5), $X$15,\n  AND(N27=\"-\", W27>=0.25), $X$14,\n  AND(N27=\"-\", W27<0.25), $X$13\n)","v":{"$error":"#DIV/0!"}}]
[{"$nulls":3},2,"El impacto no puede ser absorbido por la población expuesta ",{"$nulls":7},"3 ","+",0,0,0,0,0,0,0,0,{"$f":"(V28-$P$8)/$P$9","v":{"$error":"#DIV/0!"}},{"$f":"_xlfn.IFS(\n  AND(N28=\"+\", W28>=0.75), $Y$16,\n  AND(N28=\"+\", W28>=0.5), $Y$15,\n  AND(N28=\"+\", W28>=0.25), $Y$14,\n  AND(N28=\"+\", W28<0.25), $Y$13,\n  AND(N28=\"-\", W28>=0.75), $X$16,\n  AND(N28=\"-\", W28>=0.5), $X$15,\n  AND(N28=\"-\", W28>=0.25), $X$14,\n  AND(N28=\"-\", W28<0.25), $X$13\n)","v":{"$error":"#DIV/0!"}}]
[null,"G)","Afección a recurso compartido ",{"$nulls":9},"4 ","+",0,0,0,0,0,0,0,0,{"$f":"(V29-$P$8)/$P$9","v":{"$error":"#DIV/0!"}},{"$f":"_xlfn.IFS(\n  AND(N29=\"+\", W29>=0.75), $Y$16,\n  AND(N29=\"+\", W29>=0.5), $Y$15,\n  AND(N29=\"+\", W29>=0.25), $Y$14,\n  AND(N29=\"+\", W29<0.25), $Y$13,\n  AND(N29=\"-\", W29>=0.75), $X$16,\n  AND(N29=\"-\", W29>=0.5), $X$15,\n  AND(N29=\"-\", W29>=0.25), $X$14,\n  AND(N29=\"-\", W29<0.25), $X$13\n)","v":{"$error":"#DIV/0!"}}]
[{"$nulls":3},0,"No afecta a un recurso compartido de manera directa ",{"$nulls":7},"5 ","+",0,0,0,0,0,0,0,0,{"$error":"#DIV/0!"},{"$f":"_xlfn.IFS(\n  AND(N30=\"+\", W30>=0.75), $Y$16,\n  AND(N30=\"+\", W30>=0.5), $Y$15,\n  AND(N30=\"+\", W30>=0.25), $Y$14,\n  AND(N30=\"+\", W30<0.25), $Y$13,\n  AND(N30=\"-\", W30>=0.75), $X$16,\n  AND(N30=\"-\", W30>=0.5), $X$15,\n  AND(N30=\"-\", W30>=0.25), $X$14,\n  AND(N30=\"-\", W30<0.25), $X$13\n)","v":{"$error":"#DIV/0!"}}]
[{"$nulls":3},1,"Si afecta a un recurso compartido de manera directa ",{"$nulls":7},"6 ","+",0,0,0,0,0,0,0,0,{"$error":"#DIV/0!"},{"$f":"_xlfn.IFS(\n  AND(N31=\"+\", W31>=0.75), $Y$16,\n  AND(N31=\"+\", W31>=0.5), $Y$15,\n  AND(N31=\"+\", W31>=0.25), $Y$14,\n  AND(N31=\"+\", W31<0.25), $Y$13,\n  AND(N31=\"-\", W31>=0.75), $X$16,\n  AND(N31=\"-\", W31>=0.5), $X$15,\n  AND(N31=\"-\", W31>=0.25), $X$14,\n  AND(N31=\"-\", W31<0.25), $X$13\n)","v":{"$error":"#DIV/0!"}}]
[{"$nulls":12},"7 ","+",0,0,0,0,0,0,0,0,{"$error":"#DIV/0!"},{"$f":"_xlfn.IFS(\n  AND(N32=\"+\", W32>=0.75), $Y$16,\n  AND(N32=\"+\", W32>=0.5), $Y$15,\n  AND(N32=\"+\", W32>=0.25), $Y$14,\n  AND(N32=\"+\", W32<0.25), $Y$13,\n  AND(N32=\"-\", W32>=0.75), $X$16,\n  AND(N32=\"-\", W32>=0.5), $X$15,\n  AND(N32=\"-\", W32>=0.25), $X$14,\n  AND(N32=\"-\", W32<0.25), $X$13\n)","v":{"$error":"#DIV/0!"}}]
[{"$nulls":12},"8 ","-",0,0,0,0,0,0,0,0,{"$error":"#DIV/0!"},{"$f":"_xlfn.IFS(\n  AND(N33=\"+\", W33>=0.75), $Y$16,\n  AND(N33=\"+\", W33>=0.5), $Y$15,\n  AND(N33=\"+\", W33>=0.25), $Y$14,\n  AND(N33=\"+\", W33<0.25), $Y$13,\n  AND(N33=\"-\", W33>=0.75), $X$16,\n  AND(N33=\"-\", W33>=0.5), $X$15,\n  AND(N33=\"-\", W33>=0.25), $X$14,\n  AND(N33=\"-\", W33<0.25), $X$13\n)","v":{"$error":"#DIV/0!"}}]
[{"$nulls":12},"9 ","+",0,0,0,0,0,0,0,0,{"$error":"#DIV/0!"},{"$f":"_xlfn.IFS(\n  AND(N34=\"+\", W34>=0.75), $Y$16,\n  AND(N34=\"+\", W34>=0.5), $Y$15,\n  AND(N34=\"+\", W34>=0.25), $Y$14,\n  AND(N34=\"+\", W34<0.25), $Y$13,\n  AND(N34=\"-\", W34>=0.75), $X$16,\n  AND(N34=\"-\", W34>=0.5), $X$15,\n  AND(N34=\"-\", W34>=0.25), $X$14,\n  AND(N34=\"-\", W34<0.25), $X$13\n)","v":{"$error":"#DIV/0!"}}]

{"sheet":"Ejemplo","index":3,"n_rows":44,"n_cols":27,"rows_kept":44,"hidden":true,"merged":[[7,11,8,11],[7,12,8,12],[7,13,7,19]]}
[]
["Identificador","Atributos ","Val1 ","Val2 ","Val3 ","Val4 ","Val5 ","Total  ","Media ",null,"Observadores",5]
["A","Accesibilidad a SNS ",{"v":0,"d":"0.00"},{"v":0,"d":"0.00"},{"v":0,"d":"0.00"},{"v":0,"d":"0.00"},{"v":0,"d":"0.00"},{"$f":"SUM(C3:G3)","v":0},{"$f":"H3/$L$2","v":0}]
["B","Privación de instalaciones ",{"v":5,"d":"5.00"},{"v":5,"d":"5.00"},{"v":5,"d":"5.00"},{"v":5,"d":"5.00"},{"v":5,"d":"5.00"},{"$f":"SUM(C4:G4)","v":25},{"$f":"H4/$L$2","v":5},null,null,"Valor mínimo de susceptibilidad",null,null,{"$f":"E18*D19+E23*D24+E27*D28+E31*D32+E35*D36+E39*D40+E42*D43","v":12.6}]
["C","Barreras físicas ",{"v":0,"d":"0.00"},{"v":0,"d":"0.00"},{"v":0,"d":"0.00"},{"v":0,"d":"0.00"},{"v":0,"d":"0.00"},{"$f":"SUM(C5:G5)","v":0},0,null,null,"Valor máximo de susceptibilidad",null,null,{"$f":"E18*D22+E23*D26+E27*D30+E31*D34+E35*D38+E39*D41+E42*D44","v":37.8}]
["D","Exposición, estado de salud ",{"v":1,"d":"1.00"},{"v":2,"d":"2.00"},{"v":1,"d":"1.00"},{"v":4,"d":"4.00"},{"v":3,"d":"3.00"},11,2.2,null,null,"Rango",null,null,{"$f":"O5-O4","v":25.199999999999996}]
["E","Aceptabilidad ",{"v":4,"d":"4.00"},{"v":1,"d":"1.00"},{"v":3,"d":"3.00"},{"v":3,"d":"3.00"},{"v":4,"d":"4.00"},15,3]
["F","Resiliencia ",{"v":2,"d":"2.00"},{"v":3,"d":"3.00"},{"v":4,"d":"4.00"},{"v":2,"d":"2.00"},{"v":1,"d":"1.00"},12,2.4,null,null,"Impacto ","Signo ","Atributos"]
["G","Afección a recurso compartido ",{"v":3,"d":"3.00"},{"v":4,"d":"4.00"},{"v":2,"d":"2.00"},{"v":1,"d":"1.00"},{"v":2,"d":"2.00"},12,2.4,{"$nulls":4},"A*","B","C*","D","E","F","G"]
[{"$nulls":11},"1 ","+",null,1,null,1,1,1,1]
[{"$nulls":11},"2 ","+",null,1,null,1,1,1,0]
[{"$nulls":11},"3 ","+",null,3,null,2,1,1,1]
[{"$nulls":11},"4 ","+",null,3,null,3,1,1,1]
[{"$nulls":11},"5 ","+",null,2,null,2,1,1,0]
[null,null,"Signo",{"$nulls":8},"6 ","+",null,3,null,3,1,1,1]
[{"$nulls":3},"-","se prevée que el impacto tenga un efecto negativo sobre la población",{"$nulls":6},"7 ","+",null,3,null,1,1,2,0]
[{"$nulls":3},"+","se prevee que el impacto tenga un efecto positivo sobre la población",{"$nulls":6},"8 ","-",null,1,null,3,3,2,1]
[null,"A)","Accesibilidad al SNS",null,{"$f":"I3","v":0},{"$nulls":6},"9 ","+",null,3,null,1,1,2,0]
[{"$nulls":3},1,"Su efecto sobre la accesibilidad al SNS es limitado"]
[{"$nulls":3},2,"Su efectos sobre el SNS puede modificar determinantes en salud"]
[{"$nulls":3},3,"Su efecto en el SNS impacta directamente sobre la salud"]
[{"$nulls":3},4,"Su efecto sobre el SNS afecta al suministro de sanidad a la población afectada",{"$nulls":6},"Impacto ","Signo ","A*","B","C*","D","E","F","G","Total ","Estándar ","Susceptiblidadad ",null,"Valor estandarizado","Determinación de susceptibilidad para impactos de signo negativo","Determinación de susceptibilidad para impactos de signo positivo"]
[null,"B)","Privación de instalaciones",null,{"$f":"I4","v":5},{"$nulls":6},"1 ","+",{"v":0,"d":"0.00"},{"$f":"O10*$E$23","v":{"v":5,"d":"5.00"}},0,{"$f":"Q10*$E$31","v":{"v":2.2,"d":"2.20"}},{"$f":"R10*$E$35","v":{"v":3,"d":"3.00"}},{"$f":"S10*$E$39","v":{"v":2.4,"d":"2.40"}},{"$f":"T10*$E$42","v":2.4},{"$f":"SUM(N23:T23)","v":{"v":15,"d":"15.00"}},{"$f":"(U23-$O$4)/$O$6","v":{"v":0.09523809523809527,"d":"0.10"}},{"$f":"_xlfn.IFS(\n  AND(M23=\"+\", V23>=0.75), $AA$26,\n  AND(M23=\"+\", V23>=0.5), $AA$25,\n  AND(M23=\"+\", V23>=0.25), $AA$24,\n  AND(M23=\"+\", V23<0.25), $AA$23,\n  AND(M23=\"-\", V23>=0.75), $Z$26,\n  AND(M23=\"-\", V23>=0.5), $Z$25,\n  AND(M23=\"-\", V23>=0.25), $Z$24,\n  AND(M23=\"-\", V23<0.25), $Z$23\n)","v":"Compatible"},null,"0 - 0,25","Compatible","Compatible"]
[{"$nulls":3},1,"Tiene un efecto modesto sobre el acceso a las instalaciones",{"$nulls":6},"2 ","+",{"v":0,"d":"0.00"},{"$f":"O11*$E$23","v":{"v":5,"d":"5.00"}},0,{"$f":"Q11*$E$31","v":{"v":2.2,"d":"2.20"}},{"$f":"R11*$E$35","v":{"v":3,"d":"3.00"}},{"$f":"S11*$E$39","v":{"v":2.4,"d":"2.40"}},{"$f":"T11*$E$42","v":0},{"$f":"SUM(N24:T24)","v":{"v":12.6,"d":"12.60"}},{"v":0,"d":"0.00"},{"$f":"_xlfn.IFS(\n  AND(M24=\"+\", V24>=0.75), $AA$26,\n  AND(M24=\"+\", V24>=0.5), $AA$25,\n  AND(M24=\"+\", V24>=0.25), $AA$24,\n  AND(M24=\"+\", V24<0.25), $AA$23,\n  AND(M24=\"-\", V24>=0.75), $Z$26,\n  AND(M24=\"-\", V24>=0.5), $Z$25,\n  AND(M24=\"-\", V24>=0.25), $Z$24,\n  AND(M24=\"-\", V24<0.25), $Z$23\n)","v":"Compatible"},null,"0,26 - 0,5","Moderado","Moderado"]
[{"$nulls":3},2,"Tiene un efecto medio sobre el acceso a las instalaciones",{"$nulls":6},"3 ","+",{"v":0,"d":"0.00"},{"v":15,"d":"15.00"},0,{"v":4.4,"d":"4.40"},{"v":3,"d":"3.00"},{"v":2.4,"d":"2.40"},2.4,{"v":27.199999999999996,"d":"27.20"},{"v":0.5793650793650793,"d":"0.58"},{"$f":"_xlfn.IFS(\n  AND(M25=\"+\", V25>=0.75), $AA$26,\n  AND(M25=\"+\", V25>=0.5), $AA$25,\n  AND(M25=\"+\", V25>=0.25), $AA$24,\n  AND(M25=\"+\", V25<0.25), $AA$23,\n  AND(M25=\"-\", V25>=0.75), $Z$26,\n  AND(M25=\"-\", V25>=0.5), $Z$25,\n  AND(M25=\"-\", V25>=0.25), $Z$24,\n  AND(M25=\"-\", V25<0.25), $Z$23\n)","v":"Oportuno"},null,"0,6 - 0,75","Severo","Oportuno"]
[{"$nulls":3},3,"Tiene un gran efecto sobre el acceso a las instalaciones",{"$nulls":6},"4 ","+",{"v":0,"d":"0.00"},{"v":15,"d":"15.00"},0,{"v":6.6000000000000005,"d":"6.60"},{"v":3,"d":"3.00"},{"v":2.4,"d":"2.40"},2.4,{"v":29.4,"d":"29.40"},{"v":0.6666666666666666,"d":"0.67"},{"$f":"_xlfn.IFS(\n  AND(M26=\"+\", V26>=0.75), $AA$26,\n  AND(M26=\"+\", V26>=0.5), $AA$25,\n  AND(M26=\"+\", V26>=0.25), $AA$24,\n  AND(M26=\"+\", V26<0.25), $AA$23,\n  AND(M26=\"-\", V26>=0.75), $Z$26,\n  AND(M26=\"-\", V26>=0.5), $Z$25,\n  AND(M26=\"-\", V26>=0.25), $Z$24,\n  AND(M26=\"-\", V26<0.25), $Z$23\n)","v":"Oportuno"},null,"0,76 - 1","Crítico","Esencial"]
[null,"C)","Barreras físicas ",null,{"$f":"I5","v":0},{"$nulls":6},"5 ","+",{"v":0,"d":"0.00"},{"v":10,"d":"10.00"},0,{"v":4.4,"d":"4.40"},{"v":3,"d":"3.00"},{"v":2.4,"d":"2.40"},0,{"v":19.799999999999997,"d":"19.80"},{"v":0.28571428571428564,"d":"0.29"},{"$f":"_xlfn.IFS(\n  AND(M27=\"+\", V27>=0.75), $AA$26,\n  AND(M27=\"+\", V27>=0.5), $AA$25,\n  AND(M27=\"+\", V27>=0.25), $AA$24,\n  AND(M27=\"+\", V27<0.25), $AA$23,\n  AND(M27=\"-\", V27>=0.75), $Z$26,\n  AND(M27=\"-\", V27>=0.5), $Z$25,\n  AND(M27=\"-\", V27>=0.25), $Z$24,\n  AND(M27=\"-\", V27<0.25), $Z$23\n)","v":"Moderado"}]
[{"$nulls":3},1,"Aumenta el esfuerzo necesario para acceder a una instalación ",{"$nulls":6},"6 ","+",{"v":0,"d":"0.00"},{"v":15,"d":"15.00"},0,{"v":6.6000000000000005,"d":"6.60"},{"v":3,"d":"3.00"},{"v":2.4,"d":"2.40"},2.4,{"v":29.4,"d":"29.40"},{"v":0.6666666666666666,"d":"0.67"},{"$f":"_xlfn.IFS(\n  AND(M28=\"+\", V28>=0.75), $AA$26,\n  AND(M28=\"+\", V28>=0.5), $AA$25,\n  AND(M28=\"+\", V28>=0.25), $AA$24,\n  AND(M28=\"+\", V28<0.25), $AA$23,\n  AND(M28=\"-\", V28>=0.75), $Z$26,\n  AND(M28=\"-\", V28>=0.5), $Z$25,\n  AND(M28=\"-\", V28>=0.25), $Z$24,\n  AND(M28=\"-\", V28<0.25), $Z$23\n)","v":"Oportuno"}]
[{"$nulls":3},2,"Dificulta significativamente el acceso a una instalación ",{"$nulls":6},"7 ","+",{"v":0,"d":"0.00"},{"v":15,"d":"15.00"},0,{"v":2.2,"d":"2.20"},{"v":3,"d":"3.00"},{"v":4.8,"d":"4.80"},0,{"v":25,"d":"25.00"},{"v":0.49206349206349215,"d":"0.49"},{"$f":"_xlfn.IFS(\n  AND(M29=\"+\", V29>=0.75), $AA$26,\n  AND(M29=\"+\", V29>=0.5), $AA$25,\n  AND(M29=\"+\", V29>=0.25), $AA$24,\n  AND(M29=\"+\", V29<0.25), $AA$23,\n  AND(M29=\"-\", V29>=0.75), $Z$26,\n  AND(M29=\"-\", V29>=0.5), $Z$25,\n  AND(M29=\"-\", V29>=0.25), $Z$24,\n  AND(M29=\"-\", V29<0.25), $Z$23\n)","v":"Moderado"}]
[{"$nulls":3},3,"Imposibilita el acceso a una instalación ",{"$nulls":6},"8 ","-",{"v":0,"d":"0.00"},{"v":5,"d":"5.00"},0,{"v":6.6000000000000005,"d":"6.60"},{"v":9,"d":"9.00"},{"v":4.8,"d":"4.80"},2.4,{"v":27.8,"d":"27.80"},{"v":0.6031746031746034,"d":"0.60"},{"$f":"_xlfn.IFS(\n  AND(M30=\"+\", V30>=0.75), $AA$26,\n  AND(M30=\"+\", V30>=0.5), $AA$25,\n  AND(M30=\"+\", V30>=0.25), $AA$24,\n  AND(M30=\"+\", V30<0.25), $AA$23,\n  AND(M30=\"-\", V30>=0.75), $Z$26,\n  AND(M30=\"-\", V30>=0.5), $Z$25,\n  AND(M30=\"-\", V30>=0.25), $Z$24,\n  AND(M30=\"-\", V30<0.25), $Z$23\n)","v":"Severo"}]
[null,"D)","Exposición, estado de salud ",null,{"$f":"I6","v":2.2},{"$nulls":6},"9 ","+",{"v":0,"d":"0.00"},{"v":15,"d":"15.00"},0,{"v":2.2,"d":"2.20"},{"v":3,"d":"3.00"},{"v":4.8,"d":"4.80"},0,{"v":25,"d":"25.00"},{"v":0.49206349206349215,"d":"0.49"},{"$f":"_xlfn.IFS(\n  AND(M31=\"+\", V31>=0.75), $AA$26,\n  AND(M31=\"+\", V31>=0.5), $AA$25,\n  AND(M31=\"+\", V31>=0.25), $AA$24,\n  AND(M31=\"+\", V31<0.25), $AA$23,\n  AND(M31=\"-\", V31>=0.75), $Z$26,\n  AND(M31=\"-\", V31>=0.5), $Z$25,\n  AND(M31=\"-\", V31>=0.25), $Z$24,\n  AND(M31=\"-\", V31<0.25), $Z$23\n)","v":"Moderado"}]
[{"$nulls":3},1,"Supone un cambio leve en la exposición o agente determinante para la salud "]
[{"$nulls":3},2,"Supone un cambio medio en la exposición o agente determinante para la salud ",{"$nulls":6},"*","Al ser el peso del atributo nulo, no se evalúa dentro de los análisis de susceptibilidad"]
[{"$nulls":3},3,"Supone un cambio alto en la exposición o agente determinante para la salud "]
[null,"E)","Aceptabilidad ",null,{"$f":"I7","v":3}]
[{"$nulls":3},1,"Grado de aceptación alto "]
[{"$nulls":3},2,"Grado de aceptación medio "]
[{"$nulls":3},3,"Grado de aceptación bajo "]
[null,"F)","Resiliencia ",null,{"$f":"I8","v":2.4}]
[{"$nulls":3},1,"El impacto puede ser absorbido por la población expuesta "]
[{"$nulls":3},2,"El impacto no puede ser absorbido por la población expuesta "]
[null,"G)","Afección a recurso compartido ",null,{"$f":"I9","v":2.4}]
[{"$nulls":3},0,"No afecta a un recurso compartido de manera directa "]
[{"$nulls":3},1,"Si afecta a un recurso compartido de manera directa "]